Article delegate-en/4299 of [1-5169] on the server localhost:119
  upper oldest olders older1 this newer1 newers latest
search
[Top/Up] [oldest] - [Older+chunk] - [Newer+chunk] - [newest + Check]
[Reference:<_A4293@delegate-en.ML_>]
Newsgroups: mail-lists.delegate-en

[DeleGate-En] Re: problem comiling HPUX 11.23
24 Dec 2008 05:37:34 GMT "Bambic, David (Penske)" <pweiabdyi-pbcajt7zjb3r.ml@ml.delegate.org>



                        -DIMPSIZE=10000
        gcc  -L../lib -o ./embed embed.o version.o ../srcsign.o \
                        ../lib/library.a ../lib/libmimekit.a
../lib/libmd5.a \
                        -lnsl -lpthread -lpam -lstdc++ -lc
../lib/libsubst.a
/usr/ccs/bin/ld: Unsatisfied symbols:
   bcmp(void const*, void const*, unsigned long)(first referenced in
../lib/lib
ary.a(String.o)) (code)
   bcopy(void const*, void*, unsigned long)(first referenced in
../lib/library.
(ystring.o)) (code)
collect2: ld returned 1 exit status
*** Error exit code 1

Stop.
*** Error exit code 1

Stop.
mkmake: ERROR LOG is left at
/home/o0042/delegate/delegate9.9.1-pre4/src/mkmake
err
mkmake: ERROR LOG is left at
/home/o0042/delegate/delegate9.9.1-pre4/src/mkmake
err
*** Error exit code 1

Stop.
pltc502:

The information you requested:


1. ls -lt maker/socklen*
-rw-r--r--   1 o0042      techserv      2116 Dec 24 00:22
maker/socklen_s.o
-rw-r--r--   1 o0042      techserv        50 Dec 23 19:01
maker/socklen_u.c
-rw-r--r--   1 o0042      techserv       965 Dec 23 19:01
maker/socklen_s.c


2.  ls -lt maker/bcopy*
-rw-r--r--   1 o0042      techserv      1166 Dec 24 00:22 maker/bcopy.o
-rwxr-xr-x   1 o0042      techserv       729 Dec 23 22:59 maker/bcopy.c


3.  nm maker/socklen*.o


Symbols from maker/socklen_s.o:

Name                    Value   Scope  Type    Subspace

$CODE$              |         0|static|data   |$CODE$
$CODE$              |         0|static|data   |$CODE$
$CODE$              |         0|static|data   |$CODE$
$CODE$              |         0|static|data   |$CODE$
$CODE$              |         0|static|data   |$CODE$
$DATA$              |1073741824|static|data   |$DATA$
_GLOBAL__F__Z11XgetsockoptiiiPvPi_D1CBCD54|1073741824|extern|data
|$DATA$
_Z11XgetsockoptiiiPvPi|         0|extern|entry  |$CODE$
_Z12XgetpeernameiP8sockaddrPi|         0|extern|entry  |$CODE$
_Z12XgetsocknameiP8sockaddrPi|         0|extern|entry  |$CODE$
_Z7XacceptiP8sockaddrPi|         0|extern|entry  |$CODE$
_Z9XrecvfromiPvmiP8sockaddrPi|         0|extern|entry  |$CODE$
__gxx_personality_v0|          |undef |code   |
accept              |          |undef |code   |
getpeername         |          |undef |code   |
getsockname         |          |undef |code   |
getsockopt          |          |undef |code   |
recvfrom            |          |undef |code   |
pltc502:


4  nm maker/bcopy.o
Symbols from maker/bcopy.o:

Name                    Value   Scope  Type    Subspace

$CODE$              |         0|static|data   |$CODE$
$CODE$              |         0|static|data   |$CODE$
$CODE$              |         0|static|data   |$CODE$
SUBST_bcopy         |1073741824|extern|data   |$DATA$
_Z5bzeroPvj         |         0|extern|entry  |$CODE$
bcmp                |         0|extern|entry  |$CODE$
bcopy               |         0|extern|entry  |$CODE$
pltc502:



5.  cat maker/errors

***
gcc _.o -L../lib

***
gcc -c -o _.o -c -O2 -x c++ -DQS _.c

***
gcc _.o -L../lib ../lib/libresolvy.a   ../lib/libteleport.a
../lib/libmd5.a ../lib/libcfi.a ../lib/library.a ../lib/libmimekit.a
../lib/libfsx.a -lnsl -lpthread -lpam -lstdc++ ../lib/library.a -lc

***
gcc _.o -L../lib ../lib/libresolvy.a   ../lib/libteleport.a
../lib/libmd5.a ../lib/libcfi.a ../lib/library.a ../lib/libmimekit.a
../lib/libfsx.a -lnsl -lpthread -lpam -lstdc++ ../lib/library.a -lc

***
gcc -c -o _.o -O2 -x c++ -DQS _.c
_.c: In function 'int main()':
_.c:1: error: 'dummy' was not declared in this scope

***
gcc _.o -L../lib ../lib/libresolvy.a   ../lib/libteleport.a
../lib/libmd5.a ../lib/libcfi.a ../lib/library.a ../lib/libmimekit.a
../lib/libfsx.a -lnsl -lpthread -lpam -lstdc++ ../lib/library.a -lc
-lstdc++
_.c: In function 'int main()':
_.c:1: error: 'dummy' was not declared in this scope
gcc: _.o: No such file or directory

***
gcc -c -o _.o -O2 -x c++ -DQS _.c
_.c: In function 'int main()':
_.c:1: error: 'gxx' was not declared in this scope

***
gcc _.o -L../lib ../lib/libresolvy.a   ../lib/libteleport.a
../lib/libmd5.a ../lib/libcfi.a ../lib/library.a ../lib/libmimekit.a
../lib/libfsx.a -lnsl -lpthread -lpam -lstdc++ ../lib/library.a -lc
-lstdc++
_.c: In function 'int main()':
_.c:1: error: 'gxx' was not declared in this scope
gcc: _.o: No such file or directory

***
gcc -c -o _.o -O2 -x c++ -DQS _.c
_.c: In function 'int main()':
_.c:1: error: 'dlopen' was not declared in this scope

***
gcc _.o -L../lib ../lib/libresolvy.a   ../lib/libteleport.a
../lib/libmd5.a ../lib/libcfi.a ../lib/library.a ../lib/libmimekit.a
../lib/libfsx.a -lnsl -lpthread -lpam -lstdc++ ../lib/library.a -lc
-lstdc++
_.c: In function 'int main()':
_.c:1: error: 'dlopen' was not declared in this scope
gcc: _.o: No such file or directory

***
gcc -c -o _.o -O2 -x c++ -DQS _.c
_.c: In function 'int main()':
_.c:1: error: 'uname' was not declared in this scope

***
gcc _.o -L../lib ../lib/libresolvy.a   ../lib/libteleport.a
../lib/libmd5.a ../lib/libcfi.a ../lib/library.a ../lib/libmimekit.a
../lib/libfsx.a -lnsl -lpthread -lpam -lstdc++ ../lib/library.a -lc
-lstdc++
_.c: In function 'int main()':
_.c:1: error: 'uname' was not declared in this scope
gcc: _.o: No such file or directory

***
gcc -c -o _.o -O2 -x c++ -DQS _.c
_.c: In function 'int main()':
_.c:1: error: 'uname' was not declared in this scope

***
gcc _.o -L../lib ../lib/libresolvy.a   ../lib/libteleport.a
../lib/libmd5.a ../lib/libcfi.a ../lib/library.a ../lib/libmimekit.a
../lib/libfsx.a -lnsl -lpthread -lpam -lstdc++ ../lib/library.a -lc
-lstdc++
_.c: In function 'int main()':
_.c:1: error: 'uname' was not declared in this scope
gcc: _.o: No such file or directory

***
gcc -c -o _.o -O2 -x c++ -DQS _.c
_.c: In function 'int main()':
_.c:1: error: 'bcopy' was not declared in this scope

***
gcc _.o -L../lib ../lib/libresolvy.a   ../lib/libteleport.a
../lib/libmd5.a ../lib/libcfi.a ../lib/library.a ../lib/libmimekit.a
../lib/libfsx.a -lnsl -lpthread -lpam -lstdc++ ../lib/library.a -lc
-lstdc++
_.c: In function 'int main()':
_.c:1: error: 'bcopy' was not declared in this scope
gcc: _.o: No such file or directory

***
gcc -c -o _.o -O2 -x c++ -DQS _.c
_.c: In function 'int main()':
_.c:1: error: 'putenv' was not declared in this scope

***
gcc _.o -L../lib ../lib/libresolvy.a   ../lib/libteleport.a
../lib/libmd5.a ../lib/libcfi.a ../lib/library.a ../lib/libmimekit.a
../lib/libfsx.a -lnsl -lpthread -lpam -lstdc++ ../lib/library.a -lc
-lstdc++
_.c: In function 'int main()':
_.c:1: error: 'putenv' was not declared in this scope
gcc: _.o: No such file or directory

***
gcc -c -o _.o -O2 -x c++ -DQS _.c
_.c: In function 'int main()':
_.c:1: error: 'unsetenv' was not declared in this scope

***
gcc _.o -L../lib ../lib/libresolvy.a   ../lib/libteleport.a
../lib/libmd5.a ../lib/libcfi.a ../lib/library.a ../lib/libmimekit.a
../lib/libfsx.a -lnsl -lpthread -lpam -lstdc++ ../lib/library.a -lc
-lstdc++
_.c: In function 'int main()':
_.c:1: error: 'unsetenv' was not declared in this scope
gcc: _.o: No such file or directory

***
gcc -c -o _.o -O2 -x c++ -DQS _.c
_.c: In function 'int main()':
_.c:1: error: 'alloca' was not declared in this scope

***
gcc _.o -L../lib ../lib/libresolvy.a   ../lib/libteleport.a
../lib/libmd5.a ../lib/libcfi.a ../lib/library.a ../lib/libmimekit.a
../lib/libfsx.a -lnsl -lpthread -lpam -lstdc++ ../lib/library.a -lc
-lstdc++
_.c: In function 'int main()':
_.c:1: error: 'alloca' was not declared in this scope
gcc: _.o: No such file or directory

***
gcc -c -o _.o -O2 -x c++ -DQS _.c
_.c: In function 'int main()':
_.c:1: error: 'old_alloca' was not declared in this scope

***
gcc _.o -L../lib ../lib/libresolvy.a   ../lib/libteleport.a
../lib/libmd5.a ../lib/libcfi.a ../lib/library.a ../lib/libmimekit.a
../lib/libfsx.a -lnsl -lpthread -lpam -lstdc++ ../lib/library.a -lc
-lstdc++
_.c: In function 'int main()':
_.c:1: error: 'old_alloca' was not declared in this scope
gcc: _.o: No such file or directory

***
gcc -c -o _.o -O2 -x c++ -DQS _.c
_.c: In function 'int main()':
_.c:1: error: 'alloca' was not declared in this scope

***
gcc _.o -L../lib ../lib/libresolvy.a   ../lib/libteleport.a
../lib/libmd5.a ../lib/libcfi.a ../lib/library.a ../lib/libmimekit.a
../lib/libfsx.a -lnsl -lpthread -lpam -lstdc++ ../lib/library.a -lc
-lstdc++
_.c: In function 'int main()':
_.c:1: error: 'alloca' was not declared in this scope
gcc: _.o: No such file or directory

***
gcc -c -o _.o -O2 -x c++ -DQS _.c
_.c: In function 'int main()':
_.c:1: error: 'malloc_size' was not declared in this scope

***
gcc _.o -L../lib ../lib/libresolvy.a   ../lib/libteleport.a
../lib/libmd5.a ../lib/libcfi.a ../lib/library.a ../lib/libmimekit.a
../lib/libfsx.a -lnsl -lpthread -lpam -lstdc++ ../lib/library.a -lc
-lstdc++
_.c: In function 'int main()':
_.c:1: error: 'malloc_size' was not declared in this scope
gcc: _.o: No such file or directory

***
gcc -c -o _.o -O2 -x c++ -DQS _.c
_.c: In function 'int main()':
_.c:1: error: 'malloc_size' was not declared in this scope

***
gcc _.o -L../lib ../lib/libresolvy.a   ../lib/libteleport.a
../lib/libmd5.a ../lib/libcfi.a ../lib/library.a ../lib/libmimekit.a
../lib/libfsx.a -lnsl -lpthread -lpam -lstdc++ ../lib/library.a -lc
-lstdc++
_.c: In function 'int main()':
_.c:1: error: 'malloc_size' was not declared in this scope
gcc: _.o: No such file or directory

***
gcc -c -o _.o -O2 -x c++ -DQS _.c
_.c: In function 'int main()':
_.c:1: error: 'killpg' was not declared in this scope

***
gcc _.o -L../lib ../lib/libresolvy.a   ../lib/libteleport.a
../lib/libmd5.a ../lib/libcfi.a ../lib/library.a ../lib/libmimekit.a
../lib/libfsx.a -lnsl -lpthread -lpam -lstdc++ ../lib/library.a -lc
-lstdc++
_.c: In function 'int main()':
_.c:1: error: 'killpg' was not declared in this scope
gcc: _.o: No such file or directory

***
gcc -c -o _.o -O2 -x c++ -DQS _.c
_.c: In function 'int main()':
_.c:1: error: 'setsid' was not declared in this scope

***
gcc _.o -L../lib ../lib/libresolvy.a   ../lib/libteleport.a
../lib/libmd5.a ../lib/libcfi.a ../lib/library.a ../lib/libmimekit.a
../lib/libfsx.a -lnsl -lpthread -lpam -lstdc++ ../lib/library.a -lc
-lstdc++
_.c: In function 'int main()':
_.c:1: error: 'setsid' was not declared in this scope
gcc: _.o: No such file or directory

***
gcc -c -o _.o -O2 -x c++ -DQS _.c
_.c: In function 'int main()':
_.c:1: error: 'sigmask' was not declared in this scope

***
gcc _.o -L../lib ../lib/libresolvy.a   ../lib/libteleport.a
../lib/libmd5.a ../lib/libcfi.a ../lib/library.a ../lib/libmimekit.a
../lib/libfsx.a -lnsl -lpthread -lpam -lstdc++ ../lib/library.a -lc
-lstdc++
_.c: In function 'int main()':
_.c:1: error: 'sigmask' was not declared in this scope
gcc: _.o: No such file or directory

***
gcc -c -o _.o -O2 -x c++ -DQS _.c
_.c: In function 'int main()':
_.c:1: error: 'sigsetmask' was not declared in this scope

***
gcc _.o -L../lib ../lib/libresolvy.a   ../lib/libteleport.a
../lib/libmd5.a ../lib/libcfi.a ../lib/library.a ../lib/libmimekit.a
../lib/libfsx.a -lnsl -lpthread -lpam -lstdc++ ../lib/library.a -lc
-lstdc++
_.c: In function 'int main()':
_.c:1: error: 'sigsetmask' was not declared in this scope
gcc: _.o: No such file or directory

***
gcc -c -o _.o -O2 -x c++ -DQS _.c
_.c: In function 'int main()':
_.c:1: error: 'setresuid' was not declared in this scope

***
gcc _.o -L../lib ../lib/libresolvy.a   ../lib/libteleport.a
../lib/libmd5.a ../lib/libcfi.a ../lib/library.a ../lib/libmimekit.a
../lib/libfsx.a -lnsl -lpthread -lpam -lstdc++ ../lib/library.a -lc
-lstdc++
_.c: In function 'int main()':
_.c:1: error: 'setresuid' was not declared in this scope
gcc: _.o: No such file or directory

***
gcc -c -o _.o -O2 -x c++ -DQS _.c
_.c: In function 'int main()':
_.c:1: error: 'seteuid' was not declared in this scope

***
gcc _.o -L../lib ../lib/libresolvy.a   ../lib/libteleport.a
../lib/libmd5.a ../lib/libcfi.a ../lib/library.a ../lib/libmimekit.a
../lib/libfsx.a -lnsl -lpthread -lpam -lstdc++ ../lib/library.a -lc
-lstdc++
_.c: In function 'int main()':
_.c:1: error: 'seteuid' was not declared in this scope
gcc: _.o: No such file or directory

***
gcc -c -o _.o -O2 -x c++ -DQS _.c
_.c: In function 'int main()':
_.c:1: error: 'setegid' was not declared in this scope

***
gcc _.o -L../lib ../lib/libresolvy.a   ../lib/libteleport.a
../lib/libmd5.a ../lib/libcfi.a ../lib/library.a ../lib/libmimekit.a
../lib/libfsx.a -lnsl -lpthread -lpam -lstdc++ ../lib/library.a -lc
-lstdc++
_.c: In function 'int main()':
_.c:1: error: 'setegid' was not declared in this scope
gcc: _.o: No such file or directory

***
gcc -c -o _.o -O2 -x c++ -DQS _.c
_.c: In function 'int main()':
_.c:1: error: 'timegm' was not declared in this scope

***
gcc _.o -L../lib ../lib/libresolvy.a   ../lib/libteleport.a
../lib/libmd5.a ../lib/libcfi.a ../lib/library.a ../lib/libmimekit.a
../lib/libfsx.a -lnsl -lpthread -lpam -lstdc++ ../lib/library.a -lc
-lstdc++
_.c: In function 'int main()':
_.c:1: error: 'timegm' was not declared in this scope
gcc: _.o: No such file or directory

***
gcc -c -o _.o -O2 -x c++ -DQS _.c
_.c: In function 'int main()':
_.c:1: error: 'usleep' was not declared in this scope

***
gcc _.o -L../lib ../lib/libresolvy.a   ../lib/libteleport.a
../lib/libmd5.a ../lib/libcfi.a ../lib/library.a ../lib/libmimekit.a
../lib/libfsx.a -lnsl -lpthread -lpam -lstdc++ ../lib/library.a -lc
-lstdc++
_.c: In function 'int main()':
_.c:1: error: 'usleep' was not declared in this scope
gcc: _.o: No such file or directory

***
gcc -c -o _.o -O2 -x c++ -DQS _.c
_.c: In function 'int main()':
_.c:1: error: 'usleep' was not declared in this scope

***
gcc _.o -L../lib ../lib/libresolvy.a   ../lib/libteleport.a
../lib/libmd5.a ../lib/libcfi.a ../lib/library.a ../lib/libmimekit.a
../lib/libfsx.a -lnsl -lpthread -lpam -lstdc++ ../lib/library.a -lc
-lstdc++
_.c: In function 'int main()':
_.c:1: error: 'usleep' was not declared in this scope
gcc: _.o: No such file or directory

***
gcc -c -o _.o -O2 -x c++ -DQS _.c
_.c: In function 'int main()':
_.c:1: error: 'poll' was not declared in this scope

***
gcc _.o -L../lib ../lib/libresolvy.a   ../lib/libteleport.a
../lib/libmd5.a ../lib/libcfi.a ../lib/library.a ../lib/libmimekit.a
../lib/libfsx.a -lnsl -lpthread -lpam -lstdc++ ../lib/library.a -lc
-lstdc++
_.c: In function 'int main()':
_.c:1: error: 'poll' was not declared in this scope
gcc: _.o: No such file or directory

***
gcc -c -o _.o -O2 -x c++ -DQS _.c
_.c: In function 'int main()':
_.c:1: error: 'select' was not declared in this scope

***
gcc _.o -L../lib ../lib/libresolvy.a   ../lib/libteleport.a
../lib/libmd5.a ../lib/libcfi.a ../lib/library.a ../lib/libmimekit.a
../lib/libfsx.a -lnsl -lpthread -lpam -lstdc++ ../lib/library.a -lc
-lstdc++
_.c: In function 'int main()':
_.c:1: error: 'select' was not declared in this scope
gcc: _.o: No such file or directory

***
gcc -c -o _.o -O2 -x c++ -DQS _.c
_.c: In function 'int main()':
_.c:1: error: 'recv' was not declared in this scope

***
gcc _.o -L../lib ../lib/libresolvy.a   ../lib/libteleport.a
../lib/libmd5.a ../lib/libcfi.a ../lib/library.a ../lib/libmimekit.a
../lib/libfsx.a -lnsl -lpthread -lpam -lstdc++ ../lib/library.a -lc
-lstdc++
_.c: In function 'int main()':
_.c:1: error: 'recv' was not declared in this scope
gcc: _.o: No such file or directory

***
gcc -c -o _.o -O2 -x c++ -DQS _.c
_.c: In function 'int main()':
_.c:1: error: 'sendFd1' was not declared in this scope

***
gcc _.o -L../lib ../lib/libresolvy.a   ../lib/libteleport.a
../lib/libmd5.a ../lib/libcfi.a ../lib/library.a ../lib/libmimekit.a
../lib/libfsx.a -lnsl -lpthread -lpam -lstdc++ ../lib/library.a -lc
-lstdc++
_.c: In function 'int main()':
_.c:1: error: 'sendFd1' was not declared in this scope
gcc: _.o: No such file or directory

***
gcc -c -o _.o -O2 -x c++ -DQS _.c
_.c: In function 'int main()':
_.c:1: error: 'sendFd2' was not declared in this scope

***
gcc _.o -L../lib ../lib/libresolvy.a   ../lib/libteleport.a
../lib/libmd5.a ../lib/libcfi.a ../lib/library.a ../lib/libmimekit.a
../lib/libfsx.a -lnsl -lpthread -lpam -lstdc++ ../lib/library.a -lc
-lstdc++
_.c: In function 'int main()':
_.c:1: error: 'sendFd2' was not declared in this scope
gcc: _.o: No such file or directory

***
gcc -c -o _.o -O2 -x c++ -DQS _.c
_.c: In function 'int main()':
_.c:1: error: 'sendFd3' was not declared in this scope

***
gcc _.o -L../lib ../lib/libresolvy.a   ../lib/libteleport.a
../lib/libmd5.a ../lib/libcfi.a ../lib/library.a ../lib/libmimekit.a
../lib/libfsx.a -lnsl -lpthread -lpam -lstdc++ ../lib/library.a -lc
-lstdc++
_.c: In function 'int main()':
_.c:1: error: 'sendFd3' was not declared in this scope
gcc: _.o: No such file or directory

***
gcc -c -o _.o -O2 -x c++ -DQS _.c
_.c: In function 'int main()':
_.c:1: error: 'closesocket' was not declared in this scope

***
gcc _.o -L../lib ../lib/libresolvy.a   ../lib/libteleport.a
../lib/libmd5.a ../lib/libcfi.a ../lib/library.a ../lib/libmimekit.a
../lib/libfsx.a -lnsl -lpthread -lpam -lstdc++ ../lib/library.a -lc
-lstdc++
_.c: In function 'int main()':
_.c:1: error: 'closesocket' was not declared in this scope
gcc: _.o: No such file or directory

***
gcc -c -o _.o -O2 -x c++ -DQS _.c
_.c: In function 'int main()':
_.c:1: error: 'yp_match' was not declared in this scope

***
gcc _.o -L../lib ../lib/libresolvy.a   ../lib/libteleport.a
../lib/libmd5.a ../lib/libcfi.a ../lib/library.a ../lib/libmimekit.a
../lib/libfsx.a -lnsl -lpthread -lpam -lstdc++ ../lib/library.a -lc
-lstdc++
_.c: In function 'int main()':
_.c:1: error: 'yp_match' was not declared in this scope
gcc: _.o: No such file or directory

***
gcc -c -o _.o -O2 -x c++ -DQS _.c
_.c: In function 'int main()':
_.c:1: error: 'endhostent' was not declared in this scope

***
gcc _.o -L../lib ../lib/libresolvy.a   ../lib/libteleport.a
../lib/libmd5.a ../lib/libcfi.a ../lib/library.a ../lib/libmimekit.a
../lib/libfsx.a -lnsl -lpthread -lpam -lstdc++ ../lib/library.a -lc
-lstdc++
_.c: In function 'int main()':
_.c:1: error: 'endhostent' was not declared in this scope
gcc: _.o: No such file or directory

***
gcc -c -o _.o -O2 -x c++ -DQS _.c
_.c: In function 'int main()':
_.c:1: error: 'gethostbyname2' was not declared in this scope

***
gcc _.o -L../lib ../lib/libresolvy.a   ../lib/libteleport.a
../lib/libmd5.a ../lib/libcfi.a ../lib/library.a ../lib/libmimekit.a
../lib/libfsx.a -lnsl -lpthread -lpam -lstdc++ ../lib/library.a -lc
-lstdc++
_.c: In function 'int main()':
_.c:1: error: 'gethostbyname2' was not declared in this scope
gcc: _.o: No such file or directory

***
gcc -c -o _.o -O2 -x c++ -DQS _.c
_.c: In function 'int main()':
_.c:1: error: 'gethostbyname2' was not declared in this scope

***
gcc _.o -L../lib ../lib/libresolvy.a   ../lib/libteleport.a
../lib/libmd5.a ../lib/libcfi.a ../lib/library.a ../lib/libmimekit.a
../lib/libfsx.a -lnsl -lpthread -lpam -lstdc++ ../lib/library.a -lc
-lstdc++
_.c: In function 'int main()':
_.c:1: error: 'gethostbyname2' was not declared in this scope
gcc: _.o: No such file or directory

***
gcc -c -o _.o -O2 -x c++ -DQS _.c
_.c: In function 'int main()':
_.c:1: error: 'socklen_u' was not declared in this scope

***
gcc _.o -L../lib ../lib/libresolvy.a   ../lib/libteleport.a
../lib/libmd5.a ../lib/libcfi.a ../lib/library.a ../lib/libmimekit.a
../lib/libfsx.a -lnsl -lpthread -lpam -lstdc++ ../lib/library.a -lc
-lstdc++
_.c: In function 'int main()':
_.c:1: error: 'socklen_u' was not declared in this scope
gcc: _.o: No such file or directory

***
gcc -c -o _.o -O2 -x c++ -DQS _.c
_.c: In function 'int main()':
_.c:1: error: 'socklen_s' was not declared in this scope

***
gcc _.o -L../lib ../lib/libresolvy.a   ../lib/libteleport.a
../lib/libmd5.a ../lib/libcfi.a ../lib/library.a ../lib/libmimekit.a
../lib/libfsx.a -lnsl -lpthread -lpam -lstdc++ ../lib/library.a -lc
-lstdc++
_.c: In function 'int main()':
_.c:1: error: 'socklen_s' was not declared in this scope
gcc: _.o: No such file or directory

***
gcc -c -o _.o -O2 -x c++ -DQS _.c
_.c: In function 'int main()':
_.c:1: error: 'socketpair' was not declared in this scope

***
gcc _.o -L../lib ../lib/libresolvy.a   ../lib/libteleport.a
../lib/libmd5.a ../lib/libcfi.a ../lib/library.a ../lib/libmimekit.a
../lib/libfsx.a -lnsl -lpthread -lpam -lstdc++ ../lib/library.a -lc
-lstdc++
_.c: In function 'int main()':
_.c:1: error: 'socketpair' was not declared in this scope
gcc: _.o: No such file or directory

***
gcc -c -o _.o -O2 -x c++ -DQS _.c
_.c: In function 'int main()':
_.c:1: error: 'inet_aton' was not declared in this scope

***
gcc _.o -L../lib ../lib/libresolvy.a   ../lib/libteleport.a
../lib/libmd5.a ../lib/libcfi.a ../lib/library.a ../lib/libmimekit.a
../lib/libfsx.a -lnsl -lpthread -lpam -lstdc++ ../lib/library.a -lc
-lstdc++
_.c: In function 'int main()':
_.c:1: error: 'inet_aton' was not declared in this scope
gcc: _.o: No such file or directory

***
gcc -c -o _.o -O2 -x c++ -DQS _.c
_.c: In function 'int main()':
_.c:1: error: 'setferror' was not declared in this scope

***
gcc _.o -L../lib ../lib/libresolvy.a   ../lib/libteleport.a
../lib/libmd5.a ../lib/libcfi.a ../lib/library.a ../lib/libmimekit.a
../lib/libfsx.a -lnsl -lpthread -lpam -lstdc++ ../lib/library.a -lc
-lstdc++
_.c: In function 'int main()':
_.c:1: error: 'setferror' was not declared in this scope
gcc: _.o: No such file or directory

***
gcc -c -o _.o -O2 -x c++ -DQS _.c
_.c: In function 'int main()':
_.c:1: error: 'setferror' was not declared in this scope

***
gcc _.o -L../lib ../lib/libresolvy.a   ../lib/libteleport.a
../lib/libmd5.a ../lib/libcfi.a ../lib/library.a ../lib/libmimekit.a
../lib/libfsx.a -lnsl -lpthread -lpam -lstdc++ ../lib/library.a -lc
-lstdc++
_.c: In function 'int main()':
_.c:1: error: 'setferror' was not declared in this scope
gcc: _.o: No such file or directory

***
gcc -c -o _.o -O2 -x c++ -DQS _.c
_.c: In function 'int main()':
_.c:1: error: 'strerror' was not declared in this scope

***
gcc _.o -L../lib ../lib/libresolvy.a   ../lib/libteleport.a
../lib/libmd5.a ../lib/libcfi.a ../lib/library.a ../lib/libmimekit.a
../lib/libfsx.a -lnsl -lpthread -lpam -lstdc++ ../lib/library.a -lc
-lstdc++
_.c: In function 'int main()':
_.c:1: error: 'strerror' was not declared in this scope
gcc: _.o: No such file or directory

***
gcc -c -o _.o -O2 -x c++ -DQS _.c
_.c: In function 'int main()':
_.c:1: error: 'strcasecmp' was not declared in this scope

***
gcc _.o -L../lib ../lib/libresolvy.a   ../lib/libteleport.a
../lib/libmd5.a ../lib/libcfi.a ../lib/library.a ../lib/libmimekit.a
../lib/libfsx.a -lnsl -lpthread -lpam -lstdc++ ../lib/library.a -lc
-lstdc++
_.c: In function 'int main()':
_.c:1: error: 'strcasecmp' was not declared in this scope
gcc: _.o: No such file or directory

***
gcc -c -o _.o -O2 -x c++ -DQS _.c
_.c: In function 'int main()':
_.c:1: error: 'strcasestr' was not declared in this scope

***
gcc _.o -L../lib ../lib/libresolvy.a   ../lib/libteleport.a
../lib/libmd5.a ../lib/libcfi.a ../lib/library.a ../lib/libmimekit.a
../lib/libfsx.a -lnsl -lpthread -lpam -lstdc++ ../lib/library.a -lc
-lstdc++
_.c: In function 'int main()':
_.c:1: error: 'strcasestr' was not declared in this scope
gcc: _.o: No such file or directory

***
gcc -c -o _.o -O2 -x c++ -DQS _.c
_.c: In function 'int main()':
_.c:1: error: 'strrcasestr' was not declared in this scope

***
gcc _.o -L../lib ../lib/libresolvy.a   ../lib/libteleport.a
../lib/libmd5.a ../lib/libcfi.a ../lib/library.a ../lib/libmimekit.a
../lib/libfsx.a -lnsl -lpthread -lpam -lstdc++ ../lib/library.a -lc
-lstdc++
_.c: In function 'int main()':
_.c:1: error: 'strrcasestr' was not declared in this scope
gcc: _.o: No such file or directory

***
gcc -c -o _.o -O2 -x c++ -DQS _.c
_.c: In function 'int main()':
_.c:1: error: 'strstr' was not declared in this scope

***
gcc _.o -L../lib ../lib/libresolvy.a   ../lib/libteleport.a
../lib/libmd5.a ../lib/libcfi.a ../lib/library.a ../lib/libmimekit.a
../lib/libfsx.a -lnsl -lpthread -lpam -lstdc++ ../lib/library.a -lc
-lstdc++
_.c: In function 'int main()':
_.c:1: error: 'strstr' was not declared in this scope
gcc: _.o: No such file or directory

***
gcc -c -o _.o -O2 -x c++ -DQS _.c
_.c: In function 'int main()':
_.c:1: error: 'strdup' was not declared in this scope

***
gcc _.o -L../lib ../lib/libresolvy.a   ../lib/libteleport.a
../lib/libmd5.a ../lib/libcfi.a ../lib/library.a ../lib/libmimekit.a
../lib/libfsx.a -lnsl -lpthread -lpam -lstdc++ ../lib/library.a -lc
-lstdc++
_.c: In function 'int main()':
_.c:1: error: 'strdup' was not declared in this scope
gcc: _.o: No such file or directory

***
gcc -c -o _.o -O2 -x c++ -DQS _.c
_.c: In function 'int main()':
_.c:1: error: 'strncpy' was not declared in this scope

***
gcc _.o -L../lib ../lib/libresolvy.a   ../lib/libteleport.a
../lib/libmd5.a ../lib/libcfi.a ../lib/library.a ../lib/libmimekit.a
../lib/libfsx.a -lnsl -lpthread -lpam -lstdc++ ../lib/library.a -lc
-lstdc++
_.c: In function 'int main()':
_.c:1: error: 'strncpy' was not declared in this scope
gcc: _.o: No such file or directory

***
gcc -c -o _.o -O2 -x c++ -DQS _.c
_.c: In function 'int main()':
_.c:1: error: 'setbuffer' was not declared in this scope

***
gcc _.o -L../lib ../lib/libresolvy.a   ../lib/libteleport.a
../lib/libmd5.a ../lib/libcfi.a ../lib/library.a ../lib/libmimekit.a
../lib/libfsx.a -lnsl -lpthread -lpam -lstdc++ ../lib/library.a -lc
-lstdc++
_.c: In function 'int main()':
_.c:1: error: 'setbuffer' was not declared in this scope
gcc: _.o: No such file or directory

***
gcc -c -o _.o -O2 -x c++ -DQS _.c
_.c: In function 'int main()':
_.c:1: error: 'setlinebuf' was not declared in this scope

***
gcc _.o -L../lib ../lib/libresolvy.a   ../lib/libteleport.a
../lib/libmd5.a ../lib/libcfi.a ../lib/library.a ../lib/libmimekit.a
../lib/libfsx.a -lnsl -lpthread -lpam -lstdc++ ../lib/library.a -lc
-lstdc++
_.c: In function 'int main()':
_.c:1: error: 'setlinebuf' was not declared in this scope
gcc: _.o: No such file or directory

***
gcc -c -o _.o -O2 -x c++ -DQS _.c
_.c: In function 'int main()':
_.c:1: error: 'syslog' was not declared in this scope

***
gcc _.o -L../lib ../lib/libresolvy.a   ../lib/libteleport.a
../lib/libmd5.a ../lib/libcfi.a ../lib/library.a ../lib/libmimekit.a
../lib/libfsx.a -lnsl -lpthread -lpam -lstdc++ ../lib/library.a -lc
-lstdc++
_.c: In function 'int main()':
_.c:1: error: 'syslog' was not declared in this scope
gcc: _.o: No such file or directory

***
gcc -c -o _.o -O2 -x c++ -DQS _.c
_.c: In function 'int main()':
_.c:1: error: 'syslog' was not declared in this scope

***
gcc _.o -L../lib ../lib/libresolvy.a   ../lib/libteleport.a
../lib/libmd5.a ../lib/libcfi.a ../lib/library.a ../lib/libmimekit.a
../lib/libfsx.a -lnsl -lpthread -lpam -lstdc++ ../lib/library.a -lc
-lstdc++
_.c: In function 'int main()':
_.c:1: error: 'syslog' was not declared in this scope
gcc: _.o: No such file or directory

***
gcc -c -o _.o -O2 -x c++ -DQS _.c
_.c: In function 'int main()':
_.c:1: error: 'syscall' was not declared in this scope

***
gcc _.o -L../lib ../lib/libresolvy.a   ../lib/libteleport.a
../lib/libmd5.a ../lib/libcfi.a ../lib/library.a ../lib/libmimekit.a
../lib/libfsx.a -lnsl -lpthread -lpam -lstdc++ ../lib/library.a -lc
-lstdc++
_.c: In function 'int main()':
_.c:1: error: 'syscall' was not declared in this scope
gcc: _.o: No such file or directory

***
gcc -c -o _.o -O2 -x c++ -DQS _.c
_.c: In function 'int main()':
_.c:1: error: 'fork' was not declared in this scope

***
gcc _.o -L../lib ../lib/libresolvy.a   ../lib/libteleport.a
../lib/libmd5.a ../lib/libcfi.a ../lib/library.a ../lib/libmimekit.a
../lib/libfsx.a -lnsl -lpthread -lpam -lstdc++ ../lib/library.a -lc
-lstdc++
_.c: In function 'int main()':
_.c:1: error: 'fork' was not declared in this scope
gcc: _.o: No such file or directory

***
gcc -c -o _.o -O2 -x c++ -DQS _.c
_.c: In function 'int main()':
_.c:1: error: 'fork' was not declared in this scope

***
gcc _.o -L../lib ../lib/libresolvy.a   ../lib/libteleport.a
../lib/libmd5.a ../lib/libcfi.a ../lib/library.a ../lib/libmimekit.a
../lib/libfsx.a -lnsl -lpthread -lpam -lstdc++ ../lib/library.a -lc
-lstdc++
_.c: In function 'int main()':
_.c:1: error: 'fork' was not declared in this scope
gcc: _.o: No such file or directory

***
gcc -c -o _.o -O2 -x c++ -DQS _.c
_.c: In function 'int main()':
_.c:1: error: 'ptrace' was not declared in this scope

***
gcc _.o -L../lib ../lib/libresolvy.a   ../lib/libteleport.a
../lib/libmd5.a ../lib/libcfi.a ../lib/library.a ../lib/libmimekit.a
../lib/libfsx.a -lnsl -lpthread -lpam -lstdc++ ../lib/library.a -lc
-lstdc++
_.c: In function 'int main()':
_.c:1: error: 'ptrace' was not declared in this scope
gcc: _.o: No such file or directory

***
gcc -c -o _.o -O2 -x c++ -DQS _.c
_.c: In function 'int main()':
_.c:1: error: 'ptrace' was not declared in this scope

***
gcc _.o -L../lib ../lib/libresolvy.a   ../lib/libteleport.a
../lib/libmd5.a ../lib/libcfi.a ../lib/library.a ../lib/libmimekit.a
../lib/libfsx.a -lnsl -lpthread -lpam -lstdc++ ../lib/library.a -lc
-lstdc++
_.c: In function 'int main()':
_.c:1: error: 'ptrace' was not declared in this scope
gcc: _.o: No such file or directory

***
gcc -c -o _.o -O2 -x c++ -DQS _.c
_.c: In function 'int main()':
_.c:1: error: 'ptrace' was not declared in this scope

***
gcc _.o -L../lib ../lib/libresolvy.a   ../lib/libteleport.a
../lib/libmd5.a ../lib/libcfi.a ../lib/library.a ../lib/libmimekit.a
../lib/libfsx.a -lnsl -lpthread -lpam -lstdc++ ../lib/library.a -lc
-lstdc++
_.c: In function 'int main()':
_.c:1: error: 'ptrace' was not declared in this scope
gcc: _.o: No such file or directory

***
gcc -c -o _.o -O2 -x c++ -DQS _.c
_.c: In function 'int main()':
_.c:1: error: 'sigaction' was not declared in this scope

***
gcc _.o -L../lib ../lib/libresolvy.a   ../lib/libteleport.a
../lib/libmd5.a ../lib/libcfi.a ../lib/library.a ../lib/libmimekit.a
../lib/libfsx.a -lnsl -lpthread -lpam -lstdc++ ../lib/library.a -lc
-lstdc++
_.c: In function 'int main()':
_.c:1: error: 'sigaction' was not declared in this scope
gcc: _.o: No such file or directory

***
gcc -c -o _.o -O2 -x c++ -DQS _.c
_.c: In function 'int main()':
_.c:1: error: 'sigaction' was not declared in this scope

***
gcc _.o -L../lib ../lib/libresolvy.a   ../lib/libteleport.a
../lib/libmd5.a ../lib/libcfi.a ../lib/library.a ../lib/libmimekit.a
../lib/libfsx.a -lnsl -lpthread -lpam -lstdc++ ../lib/library.a -lc
-lstdc++
_.c: In function 'int main()':
_.c:1: error: 'sigaction' was not declared in this scope
gcc: _.o: No such file or directory

***
gcc -c -o _.o -O2 -x c++ -DQS _.c
_.c: In function 'int main()':
_.c:1: error: 'futimes' was not declared in this scope

***
gcc _.o -L../lib ../lib/libresolvy.a   ../lib/libteleport.a
../lib/libmd5.a ../lib/libcfi.a ../lib/library.a ../lib/libmimekit.a
../lib/libfsx.a -lnsl -lpthread -lpam -lstdc++ ../lib/library.a -lc
-lstdc++
_.c: In function 'int main()':
_.c:1: error: 'futimes' was not declared in this scope
gcc: _.o: No such file or directory

***
gcc -c -o _.o -O2 -x c++ -DQS _.c
_.c: In function 'int main()':
_.c:1: error: 'futimes' was not declared in this scope

***
gcc _.o -L../lib ../lib/libresolvy.a   ../lib/libteleport.a
../lib/libmd5.a ../lib/libcfi.a ../lib/library.a ../lib/libmimekit.a
../lib/libfsx.a -lnsl -lpthread -lpam -lstdc++ ../lib/library.a -lc
-lstdc++
_.c: In function 'int main()':
_.c:1: error: 'futimes' was not declared in this scope
gcc: _.o: No such file or directory

***
gcc -c -o _.o -O2 -x c++ -DQS _.c
_.c: In function 'int main()':
_.c:1: error: 'futimes_' was not declared in this scope

***
gcc _.o -L../lib ../lib/libresolvy.a   ../lib/libteleport.a
../lib/libmd5.a ../lib/libcfi.a ../lib/library.a ../lib/libmimekit.a
../lib/libfsx.a -lnsl -lpthread -lpam -lstdc++ ../lib/library.a -lc
-lstdc++
_.c: In function 'int main()':
_.c:1: error: 'futimes_' was not declared in this scope
gcc: _.o: No such file or directory

***
gcc -c -o _.o -O2 -x c++ -DQS _.c
_.c: In function 'int main()':
_.c:1: error: 'utimes' was not declared in this scope

***
gcc _.o -L../lib ../lib/libresolvy.a   ../lib/libteleport.a
../lib/libmd5.a ../lib/libcfi.a ../lib/library.a ../lib/libmimekit.a
../lib/libfsx.a -lnsl -lpthread -lpam -lstdc++ ../lib/library.a -lc
-lstdc++
_.c: In function 'int main()':
_.c:1: error: 'utimes' was not declared in this scope
gcc: _.o: No such file or directory

***
gcc -c -o _.o -O2 -x c++ -DQS _.c
_.c: In function 'int main()':
_.c:1: error: 'utimes' was not declared in this scope

***
gcc _.o -L../lib ../lib/libresolvy.a   ../lib/libteleport.a
../lib/libmd5.a ../lib/libcfi.a ../lib/library.a ../lib/libmimekit.a
../lib/libfsx.a -lnsl -lpthread -lpam -lstdc++ ../lib/library.a -lc
-lstdc++
_.c: In function 'int main()':
_.c:1: error: 'utimes' was not declared in this scope
gcc: _.o: No such file or directory

***
gcc -c -o _.o -O2 -x c++ -DQS _.c
_.c: In function 'int main()':
_.c:1: error: 'fsync' was not declared in this scope

***
gcc _.o -L../lib ../lib/libresolvy.a   ../lib/libteleport.a
../lib/libmd5.a ../lib/libcfi.a ../lib/library.a ../lib/libmimekit.a
../lib/libfsx.a -lnsl -lpthread -lpam -lstdc++ ../lib/library.a -lc
-lstdc++
_.c: In function 'int main()':
_.c:1: error: 'fsync' was not declared in this scope
gcc: _.o: No such file or directory

***
gcc -c -o _.o -O2 -x c++ -DQS _.c
_.c: In function 'int main()':
_.c:1: error: 'fchmod' was not declared in this scope

***
gcc _.o -L../lib ../lib/libresolvy.a   ../lib/libteleport.a
../lib/libmd5.a ../lib/libcfi.a ../lib/library.a ../lib/libmimekit.a
../lib/libfsx.a -lnsl -lpthread -lpam -lstdc++ ../lib/library.a -lc
-lstdc++
_.c: In function 'int main()':
_.c:1: error: 'fchmod' was not declared in this scope
gcc: _.o: No such file or directory

***
gcc -c -o _.o -O2 -x c++ -DQS _.c
_.c: In function 'int main()':
_.c:1: error: 'fchmod' was not declared in this scope

***
gcc _.o -L../lib ../lib/libresolvy.a   ../lib/libteleport.a
../lib/libmd5.a ../lib/libcfi.a ../lib/library.a ../lib/libmimekit.a
../lib/libfsx.a -lnsl -lpthread -lpam -lstdc++ ../lib/library.a -lc
-lstdc++
_.c: In function 'int main()':
_.c:1: error: 'fchmod' was not declared in this scope
gcc: _.o: No such file or directory

***
gcc -c -o _.o -O2 -x c++ -DQS _.c
_.c: In function 'int main()':
_.c:1: error: 'fchown' was not declared in this scope

***
gcc _.o -L../lib ../lib/libresolvy.a   ../lib/libteleport.a
../lib/libmd5.a ../lib/libcfi.a ../lib/library.a ../lib/libmimekit.a
../lib/libfsx.a -lnsl -lpthread -lpam -lstdc++ ../lib/library.a -lc
-lstdc++
_.c: In function 'int main()':
_.c:1: error: 'fchown' was not declared in this scope
gcc: _.o: No such file or directory

***
gcc -c -o _.o -O2 -x c++ -DQS _.c
_.c: In function 'int main()':
_.c:1: error: 'fchown' was not declared in this scope

***
gcc _.o -L../lib ../lib/libresolvy.a   ../lib/libteleport.a
../lib/libmd5.a ../lib/libcfi.a ../lib/library.a ../lib/libmimekit.a
../lib/libfsx.a -lnsl -lpthread -lpam -lstdc++ ../lib/library.a -lc
-lstdc++
_.c: In function 'int main()':
_.c:1: error: 'fchown' was not declared in this scope
gcc: _.o: No such file or directory

***
gcc -c -o _.o -O2 -x c++ -DQS _.c
_.c: In function 'int main()':
_.c:1: error: 'chown' was not declared in this scope

***
gcc _.o -L../lib ../lib/libresolvy.a   ../lib/libteleport.a
../lib/libmd5.a ../lib/libcfi.a ../lib/library.a ../lib/libmimekit.a
../lib/libfsx.a -lnsl -lpthread -lpam -lstdc++ ../lib/library.a -lc
-lstdc++
_.c: In function 'int main()':
_.c:1: error: 'chown' was not declared in this scope
gcc: _.o: No such file or directory

***
gcc -c -o _.o -O2 -x c++ -DQS _.c
_.c: In function 'int main()':
_.c:1: error: 'link' was not declared in this scope

***
gcc _.o -L../lib ../lib/libresolvy.a   ../lib/libteleport.a
../lib/libmd5.a ../lib/libcfi.a ../lib/library.a ../lib/libmimekit.a
../lib/libfsx.a -lnsl -lpthread -lpam -lstdc++ ../lib/library.a -lc
-lstdc++
_.c: In function 'int main()':
_.c:1: error: 'link' was not declared in this scope
gcc: _.o: No such file or directory

***
gcc -c -o _.o -O2 -x c++ -DQS _.c
_.c: In function 'int main()':
_.c:1: error: 'link' was not declared in this scope

***
gcc _.o -L../lib ../lib/libresolvy.a   ../lib/libteleport.a
../lib/libmd5.a ../lib/libcfi.a ../lib/library.a ../lib/libmimekit.a
../lib/libfsx.a -lnsl -lpthread -lpam -lstdc++ ../lib/library.a -lc
-lstdc++
_.c: In function 'int main()':
_.c:1: error: 'link' was not declared in this scope
gcc: _.o: No such file or directory

***
gcc -c -o _.o -O2 -x c++ -DQS _.c
_.c: In function 'int main()':
_.c:1: error: 'symlink' was not declared in this scope

***
gcc _.o -L../lib ../lib/libresolvy.a   ../lib/libteleport.a
../lib/libmd5.a ../lib/libcfi.a ../lib/library.a ../lib/libmimekit.a
../lib/libfsx.a -lnsl -lpthread -lpam -lstdc++ ../lib/library.a -lc
-lstdc++
_.c: In function 'int main()':
_.c:1: error: 'symlink' was not declared in this scope
gcc: _.o: No such file or directory

***
gcc -c -o _.o -O2 -x c++ -DQS _.c
_.c: In function 'int main()':
_.c:1: error: 'symlink' was not declared in this scope

***
gcc _.o -L../lib ../lib/libresolvy.a   ../lib/libteleport.a
../lib/libmd5.a ../lib/libcfi.a ../lib/library.a ../lib/libmimekit.a
../lib/libfsx.a -lnsl -lpthread -lpam -lstdc++ ../lib/library.a -lc
-lstdc++
_.c: In function 'int main()':
_.c:1: error: 'symlink' was not declared in this scope
gcc: _.o: No such file or directory

***
gcc -c -o _.o -O2 -x c++ -DQS _.c
_.c: In function 'int main()':
_.c:1: error: 'readlink' was not declared in this scope

***
gcc _.o -L../lib ../lib/libresolvy.a   ../lib/libteleport.a
../lib/libmd5.a ../lib/libcfi.a ../lib/library.a ../lib/libmimekit.a
../lib/libfsx.a -lnsl -lpthread -lpam -lstdc++ ../lib/library.a -lc
-lstdc++
_.c: In function 'int main()':
_.c:1: error: 'readlink' was not declared in this scope
gcc: _.o: No such file or directory

***
gcc -c -o _.o -O2 -x c++ -DQS _.c
_.c: In function 'int main()':
_.c:1: error: 'lstat' was not declared in this scope

***
gcc _.o -L../lib ../lib/libresolvy.a   ../lib/libteleport.a
../lib/libmd5.a ../lib/libcfi.a ../lib/library.a ../lib/libmimekit.a
../lib/libfsx.a -lnsl -lpthread -lpam -lstdc++ ../lib/library.a -lc
-lstdc++
_.c: In function 'int main()':
_.c:1: error: 'lstat' was not declared in this scope
gcc: _.o: No such file or directory

***
gcc -c -o _.o -O2 -x c++ -DQS _.c
_.c: In function 'int main()':
_.c:1: error: 'lstat' was not declared in this scope

***
gcc _.o -L../lib ../lib/libresolvy.a   ../lib/libteleport.a
../lib/libmd5.a ../lib/libcfi.a ../lib/library.a ../lib/libmimekit.a
../lib/libfsx.a -lnsl -lpthread -lpam -lstdc++ ../lib/library.a -lc
-lstdc++
_.c: In function 'int main()':
_.c:1: error: 'lstat' was not declared in this scope
gcc: _.o: No such file or directory

***
gcc -c -o _.o -O2 -x c++ -DQS _.c
_.c: In function 'int main()':
_.c:1: error: 'statvfs' was not declared in this scope

***
gcc _.o -L../lib ../lib/libresolvy.a   ../lib/libteleport.a
../lib/libmd5.a ../lib/libcfi.a ../lib/library.a ../lib/libmimekit.a
../lib/libfsx.a -lnsl -lpthread -lpam -lstdc++ ../lib/library.a -lc
-lstdc++
_.c: In function 'int main()':
_.c:1: error: 'statvfs' was not declared in this scope
gcc: _.o: No such file or directory

***
gcc -c -o _.o -O2 -x c++ -DQS _.c
_.c: In function 'int main()':
_.c:1: error: 'statvfs' was not declared in this scope

***
gcc _.o -L../lib ../lib/libresolvy.a   ../lib/libteleport.a
../lib/libmd5.a ../lib/libcfi.a ../lib/library.a ../lib/libmimekit.a
../lib/libfsx.a -lnsl -lpthread -lpam -lstdc++ ../lib/library.a -lc
-lstdc++
_.c: In function 'int main()':
_.c:1: error: 'statvfs' was not declared in this scope
gcc: _.o: No such file or directory

***
gcc -c -o _.o -O2 -x c++ -DQS _.c
_.c: In function 'int main()':
_.c:1: error: 'statvfs' was not declared in this scope

***
gcc _.o -L../lib ../lib/libresolvy.a   ../lib/libteleport.a
../lib/libmd5.a ../lib/libcfi.a ../lib/library.a ../lib/libmimekit.a
../lib/libfsx.a -lnsl -lpthread -lpam -lstdc++ ../lib/library.a -lc
-lstdc++
_.c: In function 'int main()':
_.c:1: error: 'statvfs' was not declared in this scope
gcc: _.o: No such file or directory

***
gcc -c -o _.o -O2 -x c++ -DQS _.c
_.c: In function 'int main()':
_.c:1: error: 'vfork' was not declared in this scope

***
gcc _.o -L../lib ../lib/libresolvy.a   ../lib/libteleport.a
../lib/libmd5.a ../lib/libcfi.a ../lib/library.a ../lib/libmimekit.a
../lib/libfsx.a -lnsl -lpthread -lpam -lstdc++ ../lib/library.a -lc
-lstdc++
_.c: In function 'int main()':
_.c:1: error: 'vfork' was not declared in this scope
gcc: _.o: No such file or directory

***
gcc -c -o _.o -O2 -x c++ -DQS _.c
_.c: In function 'int main()':
_.c:1: error: 'wait3' was not declared in this scope

***
gcc _.o -L../lib ../lib/libresolvy.a   ../lib/libteleport.a
../lib/libmd5.a ../lib/libcfi.a ../lib/library.a ../lib/libmimekit.a
../lib/libfsx.a -lnsl -lpthread -lpam -lstdc++ ../lib/library.a -lc
-lstdc++
_.c: In function 'int main()':
_.c:1: error: 'wait3' was not declared in this scope
gcc: _.o: No such file or directory

***
gcc -c -o _.o -O2 -x c++ -DQS _.c
_.c: In function 'int main()':
_.c:1: error: 'waitpid' was not declared in this scope

***
gcc _.o -L../lib ../lib/libresolvy.a   ../lib/libteleport.a
../lib/libmd5.a ../lib/libcfi.a ../lib/library.a ../lib/libmimekit.a
../lib/libfsx.a -lnsl -lpthread -lpam -lstdc++ ../lib/library.a -lc
-lstdc++
_.c: In function 'int main()':
_.c:1: error: 'waitpid' was not declared in this scope
gcc: _.o: No such file or directory

***
gcc -c -o _.o -O2 -x c++ -DQS _.c
_.c: In function 'int main()':
_.c:1: error: 'getmsg' was not declared in this scope

***
gcc _.o -L../lib ../lib/libresolvy.a   ../lib/libteleport.a
../lib/libmd5.a ../lib/libcfi.a ../lib/library.a ../lib/libmimekit.a
../lib/libfsx.a -lnsl -lpthread -lpam -lstdc++ ../lib/library.a -lc
-lstdc++
_.c: In function 'int main()':
_.c:1: error: 'getmsg' was not declared in this scope
gcc: _.o: No such file or directory

***
gcc -c -o _.o -O2 -x c++ -DQS _.c
_.c: In function 'int main()':
_.c:1: error: 'chroot' was not declared in this scope

***
gcc _.o -L../lib ../lib/libresolvy.a   ../lib/libteleport.a
../lib/libmd5.a ../lib/libcfi.a ../lib/library.a ../lib/libmimekit.a
../lib/libfsx.a -lnsl -lpthread -lpam -lstdc++ ../lib/library.a -lc
-lstdc++
_.c: In function 'int main()':
_.c:1: error: 'chroot' was not declared in this scope
gcc: _.o: No such file or directory

***
gcc -c -o _.o -O2 -x c++ -DQS _.c
_.c: In function 'int main()':
_.c:1: error: 'nice' was not declared in this scope

***
gcc _.o -L../lib ../lib/libresolvy.a   ../lib/libteleport.a
../lib/libmd5.a ../lib/libcfi.a ../lib/library.a ../lib/libmimekit.a
../lib/libfsx.a -lnsl -lpthread -lpam -lstdc++ ../lib/library.a -lc
-lstdc++
_.c: In function 'int main()':
_.c:1: error: 'nice' was not declared in this scope
gcc: _.o: No such file or directory

***
gcc -c -o _.o -O2 -x c++ -DQS _.c
_.c: In function 'int main()':
_.c:1: error: 'getrlimit' was not declared in this scope

***
gcc _.o -L../lib ../lib/libresolvy.a   ../lib/libteleport.a
../lib/libmd5.a ../lib/libcfi.a ../lib/library.a ../lib/libmimekit.a
../lib/libfsx.a -lnsl -lpthread -lpam -lstdc++ ../lib/library.a -lc
-lstdc++
_.c: In function 'int main()':
_.c:1: error: 'getrlimit' was not declared in this scope
gcc: _.o: No such file or directory

***
gcc -c -o _.o -O2 -x c++ -DQS _.c
_.c: In function 'int main()':
_.c:1: error: 'getrlimit' was not declared in this scope

***
gcc _.o -L../lib ../lib/libresolvy.a   ../lib/libteleport.a
../lib/libmd5.a ../lib/libcfi.a ../lib/library.a ../lib/libmimekit.a
../lib/libfsx.a -lnsl -lpthread -lpam -lstdc++ ../lib/library.a -lc
-lstdc++
_.c: In function 'int main()':
_.c:1: error: 'getrlimit' was not declared in this scope
gcc: _.o: No such file or directory

***
gcc -c -o _.o -O2 -x c++ -DQS _.c
_.c: In function 'int main()':
_.c:1: error: 'getrusage' was not declared in this scope

***
gcc _.o -L../lib ../lib/libresolvy.a   ../lib/libteleport.a
../lib/libmd5.a ../lib/libcfi.a ../lib/library.a ../lib/libmimekit.a
../lib/libfsx.a -lnsl -lpthread -lpam -lstdc++ ../lib/library.a -lc
-lstdc++
_.c: In function 'int main()':
_.c:1: error: 'getrusage' was not declared in this scope
gcc: _.o: No such file or directory

***
gcc -c -o _.o -O2 -x c++ -DQS _.c
_.c: In function 'int main()':
_.c:1: error: 'getrusage' was not declared in this scope

***
gcc _.o -L../lib ../lib/libresolvy.a   ../lib/libteleport.a
../lib/libmd5.a ../lib/libcfi.a ../lib/library.a ../lib/libmimekit.a
../lib/libfsx.a -lnsl -lpthread -lpam -lstdc++ ../lib/library.a -lc
-lstdc++
_.c: In function 'int main()':
_.c:1: error: 'getrusage' was not declared in this scope
gcc: _.o: No such file or directory

***
gcc -c -o _.o -O2 -x c++ -DQS _.c
_.c: In function 'int main()':
_.c:1: error: '_spawnvp' was not declared in this scope

***
gcc _.o -L../lib ../lib/libresolvy.a   ../lib/libteleport.a
../lib/libmd5.a ../lib/libcfi.a ../lib/library.a ../lib/libmimekit.a
../lib/libfsx.a -lnsl -lpthread -lpam -lstdc++ ../lib/library.a -lc
-lstdc++
_.c: In function 'int main()':
_.c:1: error: '_spawnvp' was not declared in this scope
gcc: _.o: No such file or directory

***
gcc -c -o _.o -O2 -x c++ -DQS _.c
_.c: In function 'int main()':
_.c:1: error: 'spawnvp' was not declared in this scope

***
gcc _.o -L../lib ../lib/libresolvy.a   ../lib/libteleport.a
../lib/libmd5.a ../lib/libcfi.a ../lib/library.a ../lib/libmimekit.a
../lib/libfsx.a -lnsl -lpthread -lpam -lstdc++ ../lib/library.a -lc
-lstdc++
_.c: In function 'int main()':
_.c:1: error: 'spawnvp' was not declared in this scope
gcc: _.o: No such file or directory

***
gcc -c -o _.o -O2 -x c++ -DQS _.c
_.c: In function 'int main()':
_.c:1: error: 'pawnvp' was not declared in this scope

***
gcc _.o -L../lib ../lib/libresolvy.a   ../lib/libteleport.a
../lib/libmd5.a ../lib/libcfi.a ../lib/library.a ../lib/libmimekit.a
../lib/libfsx.a -lnsl -lpthread -lpam -lstdc++ ../lib/library.a -lc
-lstdc++
_.c: In function 'int main()':
_.c:1: error: 'pawnvp' was not declared in this scope
gcc: _.o: No such file or directory

***
gcc -c -o _.o -O2 -x c++ -DQS _.c
_.c: In function 'int main()':
_.c:1: error: 'spawnvp' was not declared in this scope

***
gcc _.o -L../lib ../lib/libresolvy.a   ../lib/libteleport.a
../lib/libmd5.a ../lib/libcfi.a ../lib/library.a ../lib/libmimekit.a
../lib/libfsx.a -lnsl -lpthread -lpam -lstdc++ ../lib/library.a -lc
-lstdc++
_.c: In function 'int main()':
_.c:1: error: 'spawnvp' was not declared in this scope
gcc: _.o: No such file or directory

***
gcc -c -o _.o -O2 -x c++ -DQS _.c
_.c: In function 'int main()':
_.c:1: error: 'spawnvp_' was not declared in this scope

***
gcc _.o -L../lib ../lib/libresolvy.a   ../lib/libteleport.a
../lib/libmd5.a ../lib/libcfi.a ../lib/library.a ../lib/libmimekit.a
../lib/libfsx.a -lnsl -lpthread -lpam -lstdc++ ../lib/library.a -lc
-lstdc++
_.c: In function 'int main()':
_.c:1: error: 'spawnvp_' was not declared in this scope
gcc: _.o: No such file or directory

***
gcc -c -o _.o -O2 -x c++ -DQS _.c
_.c: In function 'int main()':
_.c:1: error: 'mutex' was not declared in this scope

***
gcc _.o -L../lib ../lib/libresolvy.a   ../lib/libteleport.a
../lib/libmd5.a ../lib/libcfi.a ../lib/library.a ../lib/libmimekit.a
../lib/libfsx.a -lnsl -lpthread -lpam -lstdc++ ../lib/library.a -lc
-lstdc++
_.c: In function 'int main()':
_.c:1: error: 'mutex' was not declared in this scope
gcc: _.o: No such file or directory

***
gcc -c -o _.o -O2 -x c++ -DQS _.c
_.c: In function 'int main()':
_.c:1: error: 'mutex' was not declared in this scope

***
gcc _.o -L../lib ../lib/libresolvy.a   ../lib/libteleport.a
../lib/libmd5.a ../lib/libcfi.a ../lib/library.a ../lib/libmimekit.a
../lib/libfsx.a -lnsl -lpthread -lpam -lstdc++ ../lib/library.a -lc
-lstdc++
_.c: In function 'int main()':
_.c:1: error: 'mutex' was not declared in this scope
gcc: _.o: No such file or directory

***
gcc -c -o _.o -O2 -x c++ -DQS _.c
_.c: In function 'int main()':
_.c:1: error: 'pthread_create' was not declared in this scope

***
gcc _.o -L../lib ../lib/libresolvy.a   ../lib/libteleport.a
../lib/libmd5.a ../lib/libcfi.a ../lib/library.a ../lib/libmimekit.a
../lib/libfsx.a -lnsl -lpthread -lpam -lstdc++ ../lib/library.a -lc
-lstdc++
_.c: In function 'int main()':
_.c:1: error: 'pthread_create' was not declared in this scope
gcc: _.o: No such file or directory

***
gcc -c -o _.o -O2 -x c++ -DQS _.c
_.c: In function 'int main()':
_.c:1: error: '_lwp_create' was not declared in this scope

***
gcc _.o -L../lib ../lib/libresolvy.a   ../lib/libteleport.a
../lib/libmd5.a ../lib/libcfi.a ../lib/library.a ../lib/libmimekit.a
../lib/libfsx.a -lnsl -lpthread -lpam -lstdc++ ../lib/library.a -lc
-lstdc++
_.c: In function 'int main()':
_.c:1: error: '_lwp_create' was not declared in this scope
gcc: _.o: No such file or directory

***
gcc -c -o _.o -O2 -x c++ -DQS _.c
_.c: In function 'int main()':
_.c:1: error: 'lwp_create' was not declared in this scope

***
gcc _.o -L../lib ../lib/libresolvy.a   ../lib/libteleport.a
../lib/libmd5.a ../lib/libcfi.a ../lib/library.a ../lib/libmimekit.a
../lib/libfsx.a -lnsl -lpthread -lpam -lstdc++ ../lib/library.a -lc
-lstdc++
_.c: In function 'int main()':
_.c:1: error: 'lwp_create' was not declared in this scope
gcc: _.o: No such file or directory

***
gcc -c -o _.o -O2 -x c++ -DQS _.c
_.c: In function 'int main()':
_.c:1: error: 'pthread_kill' was not declared in this scope

***
gcc _.o -L../lib ../lib/libresolvy.a   ../lib/libteleport.a
../lib/libmd5.a ../lib/libcfi.a ../lib/library.a ../lib/libmimekit.a
../lib/libfsx.a -lnsl -lpthread -lpam -lstdc++ ../lib/library.a -lc
-lstdc++
_.c: In function 'int main()':
_.c:1: error: 'pthread_kill' was not declared in this scope
gcc: _.o: No such file or directory

***
gcc -c -o _.o -O2 -x c++ -DQS _.c
_.c: In function 'int main()':
_.c:1: error: 'pthread_kill' was not declared in this scope

***
gcc _.o -L../lib ../lib/libresolvy.a   ../lib/libteleport.a
../lib/libmd5.a ../lib/libcfi.a ../lib/library.a ../lib/libmimekit.a
../lib/libfsx.a -lnsl -lpthread -lpam -lstdc++ ../lib/library.a -lc
-lstdc++
_.c: In function 'int main()':
_.c:1: error: 'pthread_kill' was not declared in this scope
gcc: _.o: No such file or directory

***
gcc -c -o _.o -O2 -x c++ -DQS _.c
_.c: In function 'int main()':
_.c:1: error: '_beginthread' was not declared in this scope

***
gcc _.o -L../lib ../lib/libresolvy.a   ../lib/libteleport.a
../lib/libmd5.a ../lib/libcfi.a ../lib/library.a ../lib/libmimekit.a
../lib/libfsx.a -lnsl -lpthread -lpam -lstdc++ ../lib/library.a -lc
-lstdc++
_.c: In function 'int main()':
_.c:1: error: '_beginthread' was not declared in this scope
gcc: _.o: No such file or directory

***
gcc -c -o _.o -O2 -x c++ -DQS _.c
_.c: In function 'int main()':
_.c:1: error: 'nothread' was not declared in this scope

***
gcc _.o -L../lib ../lib/libresolvy.a   ../lib/libteleport.a
../lib/libmd5.a ../lib/libcfi.a ../lib/library.a ../lib/libmimekit.a
../lib/libfsx.a -lnsl -lpthread -lpam -lstdc++ ../lib/library.a -lc
-lstdc++
_.c: In function 'int main()':
_.c:1: error: 'nothread' was not declared in this scope
gcc: _.o: No such file or directory

***
gcc -c -o _.o -O2 -x c++ -DQS _.c
_.c: In function 'int main()':
_.c:1: error: 'flock' was not declared in this scope

***
gcc _.o -L../lib ../lib/libresolvy.a   ../lib/libteleport.a
../lib/libmd5.a ../lib/libcfi.a ../lib/library.a ../lib/libmimekit.a
../lib/libfsx.a -lnsl -lpthread -lpam -lstdc++ ../lib/library.a -lc
-lstdc++
_.c: In function 'int main()':
_.c:1: error: 'flock' was not declared in this scope
gcc: _.o: No such file or directory

***
gcc -c -o _.o -O2 -x c++ -DQS _.c
_.c: In function 'int main()':
_.c:1: error: 'fcntl' was not declared in this scope

***
gcc _.o -L../lib ../lib/libresolvy.a   ../lib/libteleport.a
../lib/libmd5.a ../lib/libcfi.a ../lib/library.a ../lib/libmimekit.a
../lib/libfsx.a -lnsl -lpthread -lpam -lstdc++ ../lib/library.a -lc
-lstdc++
_.c: In function 'int main()':
_.c:1: error: 'fcntl' was not declared in this scope
gcc: _.o: No such file or directory

***
gcc -c -o _.o -O2 -x c++ -DQS _.c
_.c: In function 'int main()':
_.c:1: error: 'flockfile' was not declared in this scope

***
gcc _.o -L../lib ../lib/libresolvy.a   ../lib/libteleport.a
../lib/libmd5.a ../lib/libcfi.a ../lib/library.a ../lib/libmimekit.a
../lib/libfsx.a -lnsl -lpthread -lpam -lstdc++ ../lib/library.a -lc
-lstdc++
_.c: In function 'int main()':
_.c:1: error: 'flockfile' was not declared in this scope
gcc: _.o: No such file or directory

***
gcc -c -o _.o -O2 -x c++ -DQS _.c
_.c: In function 'int main()':
_.c:1: error: 'FMODE' was not declared in this scope

***
gcc _.o -L../lib ../lib/libresolvy.a   ../lib/libteleport.a
../lib/libmd5.a ../lib/libcfi.a ../lib/library.a ../lib/libmimekit.a
../lib/libfsx.a -lnsl -lpthread -lpam -lstdc++ ../lib/library.a -lc
-lstdc++
_.c: In function 'int main()':
_.c:1: error: 'FMODE' was not declared in this scope
gcc: _.o: No such file or directory

***
gcc -c -o _.o -O2 -x c++ -DQS _.c
_.c: In function 'int main()':
_.c:1: error: 'getwd' was not declared in this scope

***
gcc _.o -L../lib ../lib/libresolvy.a   ../lib/libteleport.a
../lib/libmd5.a ../lib/libcfi.a ../lib/library.a ../lib/libmimekit.a
../lib/libfsx.a -lnsl -lpthread -lpam -lstdc++ ../lib/library.a -lc
-lstdc++
_.c: In function 'int main()':
_.c:1: error: 'getwd' was not declared in this scope
gcc: _.o: No such file or directory

***
gcc -c -o _.o -O2 -x c++ -DQS _.c
_.c: In function 'int main()':
_.c:1: error: 'getcwd' was not declared in this scope

***
gcc _.o -L../lib ../lib/libresolvy.a   ../lib/libteleport.a
../lib/libmd5.a ../lib/libcfi.a ../lib/library.a ../lib/libmimekit.a
../lib/libfsx.a -lnsl -lpthread -lpam -lstdc++ ../lib/library.a -lc
-lstdc++
_.c: In function 'int main()':
_.c:1: error: 'getcwd' was not declared in this scope
gcc: _.o: No such file or directory

***
gcc -c -o _.o -O2 -x c++ -DQS _.c
_.c: In function 'int main()':
_.c:1: error: 'opendir' was not declared in this scope

***
gcc _.o -L../lib ../lib/libresolvy.a   ../lib/libteleport.a
../lib/libmd5.a ../lib/libcfi.a ../lib/library.a ../lib/libmimekit.a
../lib/libfsx.a -lnsl -lpthread -lpam -lstdc++ ../lib/library.a -lc
-lstdc++
_.c: In function 'int main()':
_.c:1: error: 'opendir' was not declared in this scope
gcc: _.o: No such file or directory

***
gcc -c -o _.o -O2 -x c++ -DQS _.c
_.c: In function 'int main()':
_.c:1: error: 'scandir' was not declared in this scope

***
gcc _.o -L../lib ../lib/libresolvy.a   ../lib/libteleport.a
../lib/libmd5.a ../lib/libcfi.a ../lib/library.a ../lib/libmimekit.a
../lib/libfsx.a -lnsl -lpthread -lpam -lstdc++ ../lib/library.a -lc
-lstdc++
_.c: In function 'int main()':
_.c:1: error: 'scandir' was not declared in this scope
gcc: _.o: No such file or directory

***
gcc -c -o _.o -O2 -x c++ -DQS _.c
_.c: In function 'int main()':
_.c:1: error: 'pam_start' was not declared in this scope

***
gcc _.o -L../lib ../lib/libresolvy.a   ../lib/libteleport.a
../lib/libmd5.a ../lib/libcfi.a ../lib/library.a ../lib/libmimekit.a
../lib/libfsx.a -lnsl -lpthread -lpam -lstdc++ ../lib/library.a -lc
-lstdc++
_.c: In function 'int main()':
_.c:1: error: 'pam_start' was not declared in this scope
gcc: _.o: No such file or directory

***
gcc -c -o _.o -O2 -x c++ -DQS _.c
_.c: In function 'int main()':
_.c:1: error: 'forkpty' was not declared in this scope

***
gcc _.o -L../lib ../lib/libresolvy.a   ../lib/libteleport.a
../lib/libmd5.a ../lib/libcfi.a ../lib/library.a ../lib/libmimekit.a
../lib/libfsx.a -lnsl -lpthread -lpam -lstdc++ ../lib/library.a -lc
-lstdc++
_.c: In function 'int main()':
_.c:1: error: 'forkpty' was not declared in this scope
gcc: _.o: No such file or directory

***
gcc -c -o _.o -O2 -x c++ -DQS _.c
_.c: In function 'int main()':
_.c:1: error: 'forkpty' was not declared in this scope

***
gcc _.o -L../lib ../lib/libresolvy.a   ../lib/libteleport.a
../lib/libmd5.a ../lib/libcfi.a ../lib/library.a ../lib/libmimekit.a
../lib/libfsx.a -lnsl -lpthread -lpam -lstdc++ ../lib/library.a -lc
-lstdc++
_.c: In function 'int main()':
_.c:1: error: 'forkpty' was not declared in this scope
gcc: _.o: No such file or directory

***
gcc -c -o _.o -O2 -x c++ -DQS _.c
_.c: In function 'int main()':
_.c:1: error: 'forkpty1' was not declared in this scope

***
gcc _.o -L../lib ../lib/libresolvy.a   ../lib/libteleport.a
../lib/libmd5.a ../lib/libcfi.a ../lib/library.a ../lib/libmimekit.a
../lib/libfsx.a -lnsl -lpthread -lpam -lstdc++ ../lib/library.a -lc
-lstdc++
_.c: In function 'int main()':
_.c:1: error: 'forkpty1' was not declared in this scope
gcc: _.o: No such file or directory

***
gcc -c -o _.o -O2 -x c++ -DQS _.c
_.c: In function 'int main()':
_.c:1: error: 'forkpty' was not declared in this scope

***
gcc _.o -L../lib ../lib/libresolvy.a   ../lib/libteleport.a
../lib/libmd5.a ../lib/libcfi.a ../lib/library.a ../lib/libmimekit.a
../lib/libfsx.a -lnsl -lpthread -lpam -lstdc++ ../lib/library.a -lc
-lstdc++
_.c: In function 'int main()':
_.c:1: error: 'forkpty' was not declared in this scope
gcc: _.o: No such file or directory

***
gcc -c -o _.o -O2 -x c++ -DQS _.c
_.c: In function 'int main()':
_.c:1: error: 'tcsetattr' was not declared in this scope

***
gcc _.o -L../lib ../lib/libresolvy.a   ../lib/libteleport.a
../lib/libmd5.a ../lib/libcfi.a ../lib/library.a ../lib/libmimekit.a
../lib/libfsx.a -lnsl -lpthread -lpam -lstdc++ ../lib/library.a -lc
-lstdc++
_.c: In function 'int main()':
_.c:1: error: 'tcsetattr' was not declared in this scope
gcc: _.o: No such file or directory

***
gcc -c -o _.o -O2 -x c++ -DQS _.c
_.c: In function 'int main()':
_.c:1: error: 'Stty' was not declared in this scope

***
gcc _.o -L../lib ../lib/libresolvy.a   ../lib/libteleport.a
../lib/libmd5.a ../lib/libcfi.a ../lib/library.a ../lib/libmimekit.a
../lib/libfsx.a -lnsl -lpthread -lpam -lstdc++ ../lib/library.a -lc
-lstdc++
_.c: In function 'int main()':
_.c:1: error: 'Stty' was not declared in this scope
gcc: _.o: No such file or directory

***
gcc -c -o _.o -O2 -x c++ -DQS _.c
_.c: In function 'int main()':
_.c:1: error: 'getwinsize' was not declared in this scope

***
gcc _.o -L../lib ../lib/libresolvy.a   ../lib/libteleport.a
../lib/libmd5.a ../lib/libcfi.a ../lib/library.a ../lib/libmimekit.a
../lib/libfsx.a -lnsl -lpthread -lpam -lstdc++ ../lib/library.a -lc
-lstdc++
_.c: In function 'int main()':
_.c:1: error: 'getwinsize' was not declared in this scope
gcc: _.o: No such file or directory

***
gcc -c -o _.o -O2 -x c++ -DQS _.c
_.c: In function 'int main()':
_.c:1: error: 'getwinsize' was not declared in this scope

***
gcc _.o -L../lib ../lib/libresolvy.a   ../lib/libteleport.a
../lib/libmd5.a ../lib/libcfi.a ../lib/library.a ../lib/libmimekit.a
../lib/libfsx.a -lnsl -lpthread -lpam -lstdc++ ../lib/library.a -lc
-lstdc++
_.c: In function 'int main()':
_.c:1: error: 'getwinsize' was not declared in this scope
gcc: _.o: No such file or directory

***
gcc -c -o _.o -O2 -x c++ -DQS _.c
_.c: In function 'int main()':
_.c:1: error: 'mkfifo' was not declared in this scope

***
gcc _.o -L../lib ../lib/libresolvy.a   ../lib/libteleport.a
../lib/libmd5.a ../lib/libcfi.a ../lib/library.a ../lib/libmimekit.a
../lib/libfsx.a -lnsl -lpthread -lpam -lstdc++ ../lib/library.a -lc
-lstdc++
_.c: In function 'int main()':
_.c:1: error: 'mkfifo' was not declared in this scope
gcc: _.o: No such file or directory

***
gcc -c -o _.o -O2 -x c++ -DQS _.c
_.c: In function 'int main()':
_.c:1: error: 'mkfifo' was not declared in this scope

***
gcc _.o -L../lib ../lib/libresolvy.a   ../lib/libteleport.a
../lib/libmd5.a ../lib/libcfi.a ../lib/library.a ../lib/libmimekit.a
../lib/libfsx.a -lnsl -lpthread -lpam -lstdc++ ../lib/library.a -lc
-lstdc++
_.c: In function 'int main()':
_.c:1: error: 'mkfifo' was not declared in this scope
gcc: _.o: No such file or directory

***
gcc -c -o _.o -O2 -x c++ -DQS _.c
_.c: In function 'int main()':
_.c:1: error: 'fgetpos' was not declared in this scope

***
gcc _.o -L../lib ../lib/libresolvy.a   ../lib/libteleport.a
../lib/libmd5.a ../lib/libcfi.a ../lib/library.a ../lib/libmimekit.a
../lib/libfsx.a -lnsl -lpthread -lpam -lstdc++ ../lib/library.a -lc
-lstdc++
_.c: In function 'int main()':
_.c:1: error: 'fgetpos' was not declared in this scope
gcc: _.o: No such file or directory

***
gcc -c -o _.o -O2 -x c++ -DQS _.c
_.c: In function 'int main()':
_.c:1: error: 'fgetpos' was not declared in this scope

***
gcc _.o -L../lib ../lib/libresolvy.a   ../lib/libteleport.a
../lib/libmd5.a ../lib/libcfi.a ../lib/library.a ../lib/libmimekit.a
../lib/libfsx.a -lnsl -lpthread -lpam -lstdc++ ../lib/library.a -lc
-lstdc++
_.c: In function 'int main()':
_.c:1: error: 'fgetpos' was not declared in this scope
gcc: _.o: No such file or directory

***
gcc -c -o _.o -O2 -x c++ -DQS _.c
_.c: In function 'int main()':
_.c:1: error: 'fpurge' was not declared in this scope

***
gcc _.o -L../lib ../lib/libresolvy.a   ../lib/libteleport.a
../lib/libmd5.a ../lib/libcfi.a ../lib/library.a ../lib/libmimekit.a
../lib/libfsx.a -lnsl -lpthread -lpam -lstdc++ ../lib/library.a -lc
-lstdc++
_.c: In function 'int main()':
_.c:1: error: 'fpurge' was not declared in this scope
gcc: _.o: No such file or directory

***
gcc -c -o _.o -O2 -x c++ -DQS _.c
_.c: In function 'int main()':
_.c:1: error: 'stdio' was not declared in this scope

***
gcc _.o -L../lib ../lib/libresolvy.a   ../lib/libteleport.a
../lib/libmd5.a ../lib/libcfi.a ../lib/library.a ../lib/libmimekit.a
../lib/libfsx.a -lnsl -lpthread -lpam -lstdc++ ../lib/library.a -lc
-lstdc++
_.c: In function 'int main()':
_.c:1: error: 'stdio' was not declared in this scope
gcc: _.o: No such file or directory

***
gcc -c -o _.o -O2 -x c++ -DQS _.c
_.c: In function 'int main()':
_.c:1: error: 'pendingcc1' was not declared in this scope

***
gcc _.o -L../lib ../lib/libresolvy.a   ../lib/libteleport.a
../lib/libmd5.a ../lib/libcfi.a ../lib/library.a ../lib/libmimekit.a
../lib/libfsx.a -lnsl -lpthread -lpam -lstdc++ ../lib/library.a -lc
-lstdc++
_.c: In function 'int main()':
_.c:1: error: 'pendingcc1' was not declared in this scope
gcc: _.o: No such file or directory

***
gcc -c -o _.o -O2 -x c++ -DQS _.c
_.c: In function 'int main()':
_.c:1: error: 'pendingcc' was not declared in this scope

***
gcc _.o -L../lib ../lib/libresolvy.a   ../lib/libteleport.a
../lib/libmd5.a ../lib/libcfi.a ../lib/library.a ../lib/libmimekit.a
../lib/libfsx.a -lnsl -lpthread -lpam -lstdc++ ../lib/library.a -lc
-lstdc++
_.c: In function 'int main()':
_.c:1: error: 'pendingcc' was not declared in this scope
gcc: _.o: No such file or directory

***
gcc -c -o _.o -O2 -x c++ -DQS _.c
_.c: In function 'int main()':
_.c:1: error: 'fcloseFILE' was not declared in this scope

***
gcc _.o -L../lib ../lib/libresolvy.a   ../lib/libteleport.a
../lib/libmd5.a ../lib/libcfi.a ../lib/library.a ../lib/libmimekit.a
../lib/libfsx.a -lnsl -lpthread -lpam -lstdc++ ../lib/library.a -lc
-lstdc++
_.c: In function 'int main()':
_.c:1: error: 'fcloseFILE' was not declared in this scope
gcc: _.o: No such file or directory

***
gcc -c -o _.o -O2 -x c++ -DQS _.c
_.c: In function 'int main()':
_.c:1: error: 'fcDo the more with the less -- B. Fuller

  admin search upper oldest olders older1 this newer1 newers latest
[Top/Up] [oldest] - [Older+chunk] - [Newer+chunk] - [newest + Check]
@_@V